Reaction Details
TargetProstaglandin E synthase
LigandBDBM50194140
Substrate/Competitorn/a
Meas. Tech.ChEMBL_1616435 (CHEMBL3858504)
IC50 11±n/a nM
Citation Kuklish, SLAntonysamy, SBhattachar, SNChandrasekhar, SFisher, MJFretland, AJGooding, KHarvey, AHughes, NELuz, JGManninen, PRMcGee, JENavarro, ANorman, BHPartridge, KMQuimby, SJSchiffler, MASloan, AVWarshawsky, AMYork, JSYu, XP Characterization of 3,3-dimethyl substituted N-aryl piperidines as potent microsomal prostaglandin E synthase-1 inhibitors. Bioorg Med Chem Lett26:4824-4828 (2016) 
 
Prostaglandin E synthase
Name:Prostaglandin E synthase
Type:Protein
Mol. Mass.:17112.22
Organism:Homo sapiens (Human)
Description:n/a
Residue:152
BDBM50194140
NameBDBM50194140
Synonyms:CHEMBL3947494
TypeSmall organic molecule
Emp. Form.C22H31F3N2O2
Mol. Mass.412.4889
SMILESCC1(C)CN(CC[C@@H]1C(=O)N[C@H]1CCC[C@H](CO)C1)c1ccc(cc1)C(F)(F)F