Reaction Details
TargetKappa-type opioid receptor
LigandBDBM50194236
Substrate/Competitorn/a
Meas. Tech.ChEMBL_1616609 (CHEMBL3858678)
Ki 218±n/a nM
Citation Guerrieri, EBermudez, MWolber, GBerzetei-Gurske, IPSchmidhammer, HSpetea, M Structural determinants of diphenethylamines for interaction with theż opioid receptor: Synthesis, pharmacology and molecular modeling studies. Bioorg Med Chem Lett26:4769-4774 (2016) 
 
Kappa-type opioid receptor
Name:Kappa-type opioid receptor
Type:G Protein-Coupled Receptor (GPCR)
Mol. Mass.:42648.76
Organism:Homo sapiens (Human)
Description:P41145
Residue:380
BDBM50194236
NameBDBM50194236
Synonyms:CHEMBL3950863
TypeSmall organic molecule
Emp. Form.C20H25NO
Mol. Mass.295.4186
SMILESOc1ccc(CCN(CCc2ccccc2)CC2CC2)cc1