Reaction Details
TargetChromodomain Y-like protein 2
LigandBDBM50194450
Substrate/Competitorn/a
Meas. Tech.ChEMBL_1616627 (CHEMBL3858696)
IC50 740±n/a nM
Citation Stuckey, JISimpson, CNorris-Drouin, JLCholensky, SHLee, JPasca, RCheng, NDickson, BMPearce, KHFrye, SVJames, LI Structure-Activity Relationships and Kinetic Studies of Peptidic Antagonists of CBX Chromodomains. J Med Chem59:8913-8923 (2016) 
 
Chromodomain Y-like protein 2
Name:Chromodomain Y-like protein 2
Type:PROTEIN
Mol. Mass.:56517.92
Organism:Homo sapiens (Human)
Description:ChEMBL_116982
Residue:506
BDBM50194450
NameBDBM50194450
Synonyms:CHEMBL3933207
TypeSmall organic molecule
Emp. Form.C42H64N6O8
Mol. Mass.780.993
SMILESCCN(CC)CCCC[C@H](NC(=O)[C@H](CC(C)C)NC(=O)[C@H](C)NC(=O)[C@H](Cc1ccccc1)NC(=O)c1ccc(cc1)C(C)(C)C)C(=O)N[C@@H](CO)C(O)=O