Reaction Details
TargetChromobox protein homolog 7
LigandBDBM50194464
Substrate/Competitorn/a
Meas. Tech.ChEMBL_1616628 (CHEMBL3858697)
IC50>60000±n/a nM
Citation Stuckey, JISimpson, CNorris-Drouin, JLCholensky, SHLee, JPasca, RCheng, NDickson, BMPearce, KHFrye, SVJames, LI Structure-Activity Relationships and Kinetic Studies of Peptidic Antagonists of CBX Chromodomains. J Med Chem59:8913-8923 (2016) 
 
Chromobox protein homolog 7
Name:Chromobox protein homolog 7
Type:Protein
Mol. Mass.:28351.76
Organism:Homo sapiens (Human)
Description:n/a
Residue:251
BDBM50194464
NameBDBM50194464
Synonyms:CHEMBL3898819
TypeSmall organic molecule
Emp. Form.C33H50N5O4
Mol. Mass.580.7807
SMILESCC(C)C[C@H](NC(=O)[C@H](C)NC(=O)[C@H](Cc1ccccc1)NC(=O)c1ccccc1)C(=O)NCCCCC[N+](C)(C)C