Reaction Details
TargetChromobox protein homolog 5
LigandBDBM50194260
Substrate/Competitorn/a
Meas. Tech.ChEMBL_1616626 (CHEMBL3858695)
IC50 33000±n/a nM
Citation Stuckey, JISimpson, CNorris-Drouin, JLCholensky, SHLee, JPasca, RCheng, NDickson, BMPearce, KHFrye, SVJames, LI Structure-Activity Relationships and Kinetic Studies of Peptidic Antagonists of CBX Chromodomains. J Med Chem59:8913-8923 (2016) 
 
Chromobox protein homolog 5
Name:Chromobox protein homolog 5
Type:PROTEIN
Mol. Mass.:22222.71
Organism:Homo sapiens (Human)
Description:ChEMBL_116826
Residue:191
BDBM50194260
NameBDBM50194260
Synonyms:CHEMBL3973366
TypeSmall organic molecule
Emp. Form.C40H57F3N6O8
Mol. Mass.806.9112
SMILESCCN(CC)CCCC[C@H](NC(=O)[C@H](CC(C)C)NC(=O)[C@H](C)NC(=O)[C@H](Cc1ccccc1)NC(=O)c1ccc(cc1)C(F)(F)F)C(=O)N[C@@H](CO)C(=O)OC