Reaction Details
TargetChromobox protein homolog 7
LigandBDBM50194259
Substrate/Competitorn/a
Meas. Tech.ChEMBL_1616652 (CHEMBL3858721)
Kd 97±n/a nM
Citation Stuckey, JISimpson, CNorris-Drouin, JLCholensky, SHLee, JPasca, RCheng, NDickson, BMPearce, KHFrye, SVJames, LI Structure-Activity Relationships and Kinetic Studies of Peptidic Antagonists of CBX Chromodomains. J Med Chem59:8913-8923 (2016) 
 
Chromobox protein homolog 7
Name:Chromobox protein homolog 7
Type:Protein
Mol. Mass.:28351.76
Organism:Homo sapiens (Human)
Description:n/a
Residue:251
BDBM50194259
NameBDBM50194259
Synonyms:CHEMBL3939958
TypeSmall organic molecule
Emp. Form.C43H66N6O8
Mol. Mass.795.0195
SMILESCCN(CC)CCCC[C@H](NC(=O)[C@H](CC(C)C)NC(=O)[C@H](C)NC(=O)[C@H](Cc1ccccc1)NC(=O)c1ccc(cc1)C(C)(C)C)C(=O)N[C@@H](CO)C(=O)OC