Reaction Details
TargetChromobox protein homolog 5
LigandBDBM50194257
Substrate/Competitorn/a
Meas. Tech.ChEMBL_1616626 (CHEMBL3858695)
IC50 21000±n/a nM
Citation Stuckey, JISimpson, CNorris-Drouin, JLCholensky, SHLee, JPasca, RCheng, NDickson, BMPearce, KHFrye, SVJames, LI Structure-Activity Relationships and Kinetic Studies of Peptidic Antagonists of CBX Chromodomains. J Med Chem59:8913-8923 (2016) 
 
Chromobox protein homolog 5
Name:Chromobox protein homolog 5
Type:PROTEIN
Mol. Mass.:22222.71
Organism:Homo sapiens (Human)
Description:ChEMBL_116826
Residue:191
BDBM50194257
NameBDBM50194257
Synonyms:CHEMBL3925993
TypeSmall organic molecule
Emp. Form.C40H60N6O8
Mol. Mass.752.9398
SMILESCCN(CC)CCCC[C@H](NC(=O)[C@H](CC(C)C)NC(=O)[C@H](C)NC(=O)[C@H](Cc1ccccc1)NC(=O)c1ccc(C)cc1)C(=O)N[C@@H](CO)C(=O)OC