Reaction Details
TargetE3 SUMO-protein ligase CBX4
LigandBDBM50194462
Substrate/Competitorn/a
Meas. Tech.ChEMBL_1616630 (CHEMBL3858699)
IC50 640±n/a nM
Citation Stuckey, JISimpson, CNorris-Drouin, JLCholensky, SHLee, JPasca, RCheng, NDickson, BMPearce, KHFrye, SVJames, LI Structure-Activity Relationships and Kinetic Studies of Peptidic Antagonists of CBX Chromodomains. J Med Chem59:8913-8923 (2016) 
 
E3 SUMO-protein ligase CBX4
Name:E3 SUMO-protein ligase CBX4
Type:PROTEIN
Mol. Mass.:61401.05
Organism:Homo sapiens (Human)
Description:ChEMBL_108273
Residue:560
BDBM50194462
NameBDBM50194462
Synonyms:CHEMBL3898460
TypeSmall organic molecule
Emp. Form.C44H68N6O8
Mol. Mass.809.0461
SMILESCC[C@H](NC(=O)[C@H](Cc1ccccc1)NC(=O)c1ccc(cc1)C(C)(C)C)C(=O)N[C@@H](CC(C)C)C(=O)N[C@@H](CCCCN(CC)CC)C(=O)N[C@@H](CO)C(=O)OC