Reaction Details
TargetChromobox protein homolog 8
LigandBDBM50194470
Substrate/Competitorn/a
Meas. Tech.ChEMBL_1616629 (CHEMBL3858698)
IC50>60000±n/a nM
Citation Stuckey, JISimpson, CNorris-Drouin, JLCholensky, SHLee, JPasca, RCheng, NDickson, BMPearce, KHFrye, SVJames, LI Structure-Activity Relationships and Kinetic Studies of Peptidic Antagonists of CBX Chromodomains. J Med Chem59:8913-8923 (2016) 
 
Chromobox protein homolog 8
Name:Chromobox protein homolog 8
Type:PROTEIN
Mol. Mass.:43415.86
Organism:Homo sapiens (Human)
Description:ChEMBL_108272
Residue:389
BDBM50194470
NameBDBM50194470
Synonyms:CHEMBL3982833
TypeSmall organic molecule
Emp. Form.C47H67N7O9
Mol. Mass.874.0764
SMILESCOC(=O)[C@H](CO)NC(=O)[C@H](CCCCNC1C2CC3CC(C2)CC1C3)NC(=O)[C@H](CC(C)C)NC(=O)[C@H](C)NC(=O)[C@H](Cc1ccccc1)NC(=O)CNC(=O)c1ccccc1