Reaction Details
TargetChromodomain Y-like protein 2
LigandBDBM50194470
Substrate/Competitorn/a
Meas. Tech.ChEMBL_1616627 (CHEMBL3858696)
IC50 14000±n/a nM
Citation Stuckey, JISimpson, CNorris-Drouin, JLCholensky, SHLee, JPasca, RCheng, NDickson, BMPearce, KHFrye, SVJames, LI Structure-Activity Relationships and Kinetic Studies of Peptidic Antagonists of CBX Chromodomains. J Med Chem59:8913-8923 (2016) 
 
Chromodomain Y-like protein 2
Name:Chromodomain Y-like protein 2
Type:PROTEIN
Mol. Mass.:56517.92
Organism:Homo sapiens (Human)
Description:ChEMBL_116982
Residue:506
BDBM50194470
NameBDBM50194470
Synonyms:CHEMBL3982833
TypeSmall organic molecule
Emp. Form.C47H67N7O9
Mol. Mass.874.0764
SMILESCOC(=O)[C@H](CO)NC(=O)[C@H](CCCCNC1C2CC3CC(C2)CC1C3)NC(=O)[C@H](CC(C)C)NC(=O)[C@H](C)NC(=O)[C@H](Cc1ccccc1)NC(=O)CNC(=O)c1ccccc1