Reaction Details
TargetE3 SUMO-protein ligase CBX4
LigandBDBM50194469
Substrate/Competitorn/a
Meas. Tech.ChEMBL_1616630 (CHEMBL3858699)
IC50 750±n/a nM
Citation Stuckey, JISimpson, CNorris-Drouin, JLCholensky, SHLee, JPasca, RCheng, NDickson, BMPearce, KHFrye, SVJames, LI Structure-Activity Relationships and Kinetic Studies of Peptidic Antagonists of CBX Chromodomains. J Med Chem59:8913-8923 (2016) 
 
E3 SUMO-protein ligase CBX4
Name:E3 SUMO-protein ligase CBX4
Type:PROTEIN
Mol. Mass.:61401.05
Organism:Homo sapiens (Human)
Description:ChEMBL_108273
Residue:560
BDBM50194469
NameBDBM50194469
Synonyms:CHEMBL3937936
TypeSmall organic molecule
Emp. Form.C40H60N6O9
Mol. Mass.768.9392
SMILESCCN(CC)CCCC[C@H](NC(=O)[C@H](CC(C)C)NC(=O)[C@H](C)NC(=O)[C@H](Cc1ccccc1)NC(=O)c1ccc(OC)cc1)C(=O)N[C@@H](CO)C(=O)OC