Reaction Details
TargetChromobox protein homolog 8
LigandBDBM50194447
Substrate/Competitorn/a
Meas. Tech.ChEMBL_1616629 (CHEMBL3858698)
IC50 24000±n/a nM
Citation Stuckey, JISimpson, CNorris-Drouin, JLCholensky, SHLee, JPasca, RCheng, NDickson, BMPearce, KHFrye, SVJames, LI Structure-Activity Relationships and Kinetic Studies of Peptidic Antagonists of CBX Chromodomains. J Med Chem59:8913-8923 (2016) 
 
Chromobox protein homolog 8
Name:Chromobox protein homolog 8
Type:PROTEIN
Mol. Mass.:43415.86
Organism:Homo sapiens (Human)
Description:ChEMBL_108272
Residue:389
BDBM50194447
NameBDBM50194447
Synonyms:CHEMBL3978944
TypeSmall organic molecule
Emp. Form.C44H62N6O8
Mol. Mass.802.9985
SMILESCCN(CC)CCCC[C@H](NC(=O)[C@H](CC(C)C)NC(=O)[C@H](C)NC(=O)[C@H](Cc1ccccc1)NC(=O)Cc1ccc2ccccc2c1)C(=O)N[C@@H](CO)C(=O)OC