Reaction Details
TargetTyrosine-protein kinase BTK
LigandBDBM50194715
Substrate/Competitorn/a
Meas. Tech.ChEMBL_1616861 (CHEMBL3858930)
IC50 8.0±n/a nM
Citation Watterson, SHDe Lucca, GVShi, QLangevine, CMLiu, QBatt, DGBeaudoin Bertrand, MGong, HDai, JYip, SLi, PSun, DWu, DRWang, CZhang, YTraeger, SCPattoli, MASkala, SCheng, LObermeier, MTVickery, RDiscenza, LND'Arienzo, CJZhang, YHeimrich, EGillooly, KMTaylor, TLPulicicchio, CMcIntyre, KWGalella, MATebben, AJMuckelbauer, JKChang, CRampulla, RMathur, ASalter-Cid, LBarrish, JCCarter, PHFura, ABurke, JRTino, JA Discovery of 6-Fluoro-5-(R)-(3-(S)-(8-fluoro-1-methyl-2,4-dioxo-1,2-dihydroquinazolin-3(4H)-yl)-2-methylphenyl)-2-(S)-(2-hydroxypropan-2-yl)-2,3,4,9-tetrahydro-1H-carbazole-8-carboxamide (BMS-986142): A Reversible Inhibitor of Bruton's Tyrosine Kinase (BTK) Conformationally Constrained by Two Locke J Med Chem59:9173-9200 (2016) 
 
Tyrosine-protein kinase BTK
Name:Tyrosine-protein kinase BTK
Type:Enzyme
Mol. Mass.:76289.95
Organism:Homo sapiens (Human)
Description:Q06187
Residue:659
BDBM50194715
NameBDBM50194715
Synonyms:CHEMBL3918580
TypeSmall organic molecule
Emp. Form.C31H26N4O3
Mol. Mass.502.5631
SMILESCc1c(cccc1-n1cnc2ccccc2c1=O)-c1ccc(C(O)=N)c2[nH]c3cc(ccc3c12)C(C)(C)O