Reaction Details
TargetTyrosine-protein kinase BTK
LigandBDBM50194720
Substrate/Competitorn/a
Meas. Tech.ChEMBL_1616867 (CHEMBL3858936)
IC50 140±n/a nM
Citation Watterson, SHDe Lucca, GVShi, QLangevine, CMLiu, QBatt, DGBeaudoin Bertrand, MGong, HDai, JYip, SLi, PSun, DWu, DRWang, CZhang, YTraeger, SCPattoli, MASkala, SCheng, LObermeier, MTVickery, RDiscenza, LND'Arienzo, CJZhang, YHeimrich, EGillooly, KMTaylor, TLPulicicchio, CMcIntyre, KWGalella, MATebben, AJMuckelbauer, JKChang, CRampulla, RMathur, ASalter-Cid, LBarrish, JCCarter, PHFura, ABurke, JRTino, JA Discovery of 6-Fluoro-5-(R)-(3-(S)-(8-fluoro-1-methyl-2,4-dioxo-1,2-dihydroquinazolin-3(4H)-yl)-2-methylphenyl)-2-(S)-(2-hydroxypropan-2-yl)-2,3,4,9-tetrahydro-1H-carbazole-8-carboxamide (BMS-986142): A Reversible Inhibitor of Bruton's Tyrosine Kinase (BTK) Conformationally Constrained by Two Locke J Med Chem59:9173-9200 (2016) 
 
Tyrosine-protein kinase BTK
Name:Tyrosine-protein kinase BTK
Type:PROTEIN
Mol. Mass.:76447.19
Organism:Mus musculus
Description:ChEMBL_108319
Residue:659
BDBM50194720
NameBDBM50194720
Synonyms:CHEMBL3900554
TypeSmall organic molecule
Emp. Form.C32H30F2N4O4
Mol. Mass.572.6018
SMILES[H][C@@]1(CCc2c(C1)[nH]c1c(cc(F)c(-c3cccc(c3C)-n3c(=O)n(C)c4c(F)cccc4c3=O)c21)C(O)=N)C(C)(C)O