Reaction Details
TargetHistone-arginine methyltransferase CARM1
LigandBDBM50194758
Substrate/Competitorn/a
Meas. Tech.ChEMBL_1616973 (CHEMBL3859042)
IC50 27±n/a nM
Citation Shen, YSzewczyk, MMEram, MSSmil, DKaniskan, HÜde Freitas, RFSenisterra, GLi, FSchapira, MBrown, PJArrowsmith, CHBarsyte-Lovejoy, DLiu, JVedadi, MJin, J Discovery of a Potent, Selective, and Cell-Active Dual Inhibitor of Protein Arginine Methyltransferase 4 and Protein Arginine Methyltransferase 6. J Med Chem59:9124-9139 (2016) 
 
Histone-arginine methyltransferase CARM1
Name:Histone-arginine methyltransferase CARM1
Type:Protein
Mol. Mass.:65855.47
Organism:Homo sapiens (Human)
Description:Q86X55
Residue:608
BDBM50194758
NameBDBM50194758
Synonyms:CHEMBL3970878
TypeSmall organic molecule
Emp. Form.C21H28N2O
Mol. Mass.324.4598
SMILESCNCCN1CCC(CC1)OCc1cccc(c1)-c1ccccc1