Reaction Details
TargetProtein arginine N-methyltransferase 8
LigandBDBM50194772
Substrate/Competitorn/a
Meas. Tech.ChEMBL_1616980 (CHEMBL3859049)
IC50 1850±n/a nM
Citation Shen, YSzewczyk, MMEram, MSSmil, DKaniskan, HÜde Freitas, RFSenisterra, GLi, FSchapira, MBrown, PJArrowsmith, CHBarsyte-Lovejoy, DLiu, JVedadi, MJin, J Discovery of a Potent, Selective, and Cell-Active Dual Inhibitor of Protein Arginine Methyltransferase 4 and Protein Arginine Methyltransferase 6. J Med Chem59:9124-9139 (2016) 
 
Protein arginine N-methyltransferase 8
Name:Protein arginine N-methyltransferase 8
Type:Protein
Mol. Mass.:45293.70
Organism:Homo sapiens (Human)
Description:n/a
Residue:394
BDBM50194772
NameBDBM50194772
Synonyms:CHEMBL3955728
TypeSmall organic molecule
Emp. Form.C15H23FN2O
Mol. Mass.266.3543
SMILESCNCCN1CCC(CC1)OCc1cccc(F)c1