Reaction Details
TargetHistone-arginine methyltransferase CARM1
LigandBDBM50194773
Substrate/Competitorn/a
Meas. Tech.ChEMBL_1616973 (CHEMBL3859042)
IC50 42±n/a nM
Citation Shen, YSzewczyk, MMEram, MSSmil, DKaniskan, HÜde Freitas, RFSenisterra, GLi, FSchapira, MBrown, PJArrowsmith, CHBarsyte-Lovejoy, DLiu, JVedadi, MJin, J Discovery of a Potent, Selective, and Cell-Active Dual Inhibitor of Protein Arginine Methyltransferase 4 and Protein Arginine Methyltransferase 6. J Med Chem59:9124-9139 (2016) 
 
Histone-arginine methyltransferase CARM1
Name:Histone-arginine methyltransferase CARM1
Type:Protein
Mol. Mass.:65855.47
Organism:Homo sapiens (Human)
Description:Q86X55
Residue:608
BDBM50194773
NameBDBM50194773
Synonyms:CHEMBL3939593
TypeSmall organic molecule
Emp. Form.C21H34N2O
Mol. Mass.330.5075
SMILESCNCCN1CCC(CC1)OCc1ccc(cc1)C1CCCCC1