Reaction Details
TargetTransient receptor potential cation channel subfamily V member 4
LigandBDBM50195058
Substrate/Competitorn/a
Meas. Tech.ChEMBL_1617390 (CHEMBL3859459)
IC50 9.5±n/a nM
Citation Tsuno, NYukimasa, AYoshida, OIchihashi, YInoue, TUeno, TYamaguchi, HMatsuda, HFunaki, SYamanada, NTanimura, MNagamatsu, DNishimura, YIto, TSoga, MHorita, NYamamoto, MHinata, MImai, MMorioka, YKanemasa, TSakaguchi, GIso, Y Discovery of novel 2',4'-dimethyl-[4,5'-bithiazol]-2-yl amino derivatives as orally bioavailable TRPV4 antagonists for the treatment of pain: Part 1. Bioorg Med Chem Lett26:4930-4935 (2016) 
 
Transient receptor potential cation channel subfamily V member 4
Name:Transient receptor potential cation channel subfamily V member 4
Type:Enzyme
Mol. Mass.:98290.10
Organism:Homo sapiens (Human)
Description:Q9HBA0
Residue:871
BDBM50195058
NameBDBM50195058
Synonyms:CHEMBL3979286
TypeSmall organic molecule
Emp. Form.C20H16ClN5OS2
Mol. Mass.441.957
SMILESCc1nc(C)c(s1)-c1csc(Nc2ccc(cn2)C(=O)Nc2ccc(Cl)cc2)n1