Reaction Details
TargetRenin
LigandBDBM50195228
Substrate/Competitorn/a
Meas. Tech.ChEMBL_1617511 (CHEMBL3859580)
IC50 1.2±n/a nM
Citation Imaeda, YTawada, MSuzuki, STomimoto, MKondo, MTarui, NSanada, TKanagawa, RSnell, GBehnke, CAKubo, KKuroita, T Structure-based design of a new series of N-(piperidin-3-yl)pyrimidine-5-carboxamides as renin inhibitors. Bioorg Med Chem24:5771-5780 (2016) 
 
Renin
Name:Renin
Type:Enzyme
Mol. Mass.:45058.99
Organism:Homo sapiens (Human)
Description:n/a
Residue:406
BDBM50195228
NameBDBM50195228
Synonyms:CHEMBL3925242
TypeSmall organic molecule
Emp. Form.C23H37Cl2N5O2
Mol. Mass.486.478
SMILESCl.Cl.CC(C)CN(C1CCCNC1)C(=O)c1cnc(nc1NCc1ccco1)C(C)(C)C