Reaction Details
TargetCathepsin K
LigandBDBM50195235
Substrate/Competitorn/a
Meas. Tech.ChEMBL_1617587 (CHEMBL3859656)
IC50>20000±n/a nM
Citation Connolly, SLönn, HKäck, HVan de Poël, ADahl, GDoyle, KGardiner, PRoot, JWikell, CJohannesson, PStenvall, KSwallow, S Discovery of Second Generation Reversible Covalent DPP1 Inhibitors Leading to an Oxazepane Amidoacetonitrile Based Clinical Candidate (AZD7986). J Med Chem59:9457-9472 (2016) 
 
Cathepsin K
Name:Cathepsin K
Type:Enzyme
Mol. Mass.:36975.68
Organism:Homo sapiens (Human)
Description:P43235
Residue:329
BDBM50195235
NameBDBM50195235
Synonyms:CHEMBL3900409 US10669245, Example 2 US11655221, Example 2 US20230278969, Example 2
TypeSmall organic molecule
Emp. Form.C23H24N4O4
Mol. Mass.420.4611
SMILESCn1c2cc(ccc2oc1=O)-c1ccc(C[C@H](NC(=O)[C@@H]2CNCCCO2)C#N)cc1