Reaction Details
TargetDipeptidyl peptidase 1
LigandBDBM50195255
Substrate/Competitorn/a
Meas. Tech.ChEMBL_1617559 (CHEMBL3859628)
IC50 40±n/a nM
Citation Connolly, SLönn, HKäck, HVan de Poël, ADahl, GDoyle, KGardiner, PRoot, JWikell, CJohannesson, PStenvall, KSwallow, S Discovery of Second Generation Reversible Covalent DPP1 Inhibitors Leading to an Oxazepane Amidoacetonitrile Based Clinical Candidate (AZD7986). J Med Chem59:9457-9472 (2016) 
 
Dipeptidyl peptidase 1
Name:Dipeptidyl peptidase 1
Type:Enzyme
Mol. Mass.:51857.28
Organism:Homo sapiens (Human)
Description:P53634
Residue:463
BDBM50195255
NameBDBM50195255
Synonyms:CHEMBL3945475 US10669245, Example 6 US11655221, Example 6 US20230278969, Example 6
TypeSmall organic molecule
Emp. Form.C22H22F3N3O2
Mol. Mass.417.4242
SMILESFC(F)(F)c1ccc(cc1)-c1ccc(C[C@H](NC(=O)[C@@H]2CNCCCO2)C#N)cc1