Reaction Details
TargetDipeptidyl peptidase 1
LigandBDBM50195259
Substrate/Competitorn/a
Meas. Tech.ChEMBL_1617559 (CHEMBL3859628)
IC50 1000±n/a nM
Citation Connolly, SLönn, HKäck, HVan de Poël, ADahl, GDoyle, KGardiner, PRoot, JWikell, CJohannesson, PStenvall, KSwallow, S Discovery of Second Generation Reversible Covalent DPP1 Inhibitors Leading to an Oxazepane Amidoacetonitrile Based Clinical Candidate (AZD7986). J Med Chem59:9457-9472 (2016) 
 
Dipeptidyl peptidase 1
Name:Dipeptidyl peptidase 1
Type:Enzyme
Mol. Mass.:51857.28
Organism:Homo sapiens (Human)
Description:P53634
Residue:463
BDBM50195259
NameBDBM50195259
Synonyms:CHEMBL3898680
TypeSmall organic molecule
Emp. Form.C23H24N4O
Mol. Mass.372.4629
SMILESNC1CCCCC1C(=O)N[C@@H](Cc1ccc(cc1)-c1cccc(c1)C#N)C#N