Reaction Details
TargetDipeptidyl peptidase 1
LigandBDBM50195245
Substrate/Competitorn/a
Meas. Tech.ChEMBL_1617560 (CHEMBL3859629)
IC50 16±n/a nM
Citation Connolly, SLönn, HKäck, HVan de Poël, ADahl, GDoyle, KGardiner, PRoot, JWikell, CJohannesson, PStenvall, KSwallow, S Discovery of Second Generation Reversible Covalent DPP1 Inhibitors Leading to an Oxazepane Amidoacetonitrile Based Clinical Candidate (AZD7986). J Med Chem59:9457-9472 (2016) 
 
Dipeptidyl peptidase 1
Name:Dipeptidyl peptidase 1
Type:Enzyme
Mol. Mass.:51857.28
Organism:Homo sapiens (Human)
Description:P53634
Residue:463
BDBM50195245
NameBDBM50195245
Synonyms:CHEMBL3972158 US10669245, Example 5 US11655221, Example 5 US20230278969, Example 5
TypeSmall organic molecule
Emp. Form.C23H24N4O3
Mol. Mass.404.4617
SMILESCc1noc2ccc(cc12)-c1ccc(C[C@H](NC(=O)[C@@H]2CNCCCO2)C#N)cc1