Reaction Details
TargetAlpha-1A adrenergic receptor
LigandBDBM50195269
Substrate/Competitorn/a
Meas. Tech.ChEMBL_1617618 (CHEMBL3859687)
IC50 1474±n/a nM
Citation Guo, DLi, JLin, HZhou, YChen, YZhao, FSun, HZhang, DLi, HShoichet, BKShan, LZhang, WXie, XJiang, HLiu, H Design, Synthesis, and Biological Evaluation of Novel Tetrahydroprotoberberine Derivatives (THPBs) as Selectivea J Med Chem59:9489-9502 (2016) 
 
Alpha-1A adrenergic receptor
Name:Alpha-1A adrenergic receptor
Type:Cell-surface receptors
Mol. Mass.:51511.67
Organism:Homo sapiens (Human)
Description:P35348
Residue:466
BDBM50195269
NameBDBM50195269
Synonyms:CHEMBL3985901
TypeSmall organic molecule
Emp. Form.C21H20N2O2
Mol. Mass.332.3957
SMILESCn1c2CN3CCc4cc5OCOc5cc4C3Cc2c2ccccc12