Reaction Details
TargetAlpha-1A adrenergic receptor
LigandBDBM50195272
Substrate/Competitorn/a
Meas. Tech.ChEMBL_1617618 (CHEMBL3859687)
IC50 254±n/a nM
Citation Guo, DLi, JLin, HZhou, YChen, YZhao, FSun, HZhang, DLi, HShoichet, BKShan, LZhang, WXie, XJiang, HLiu, H Design, Synthesis, and Biological Evaluation of Novel Tetrahydroprotoberberine Derivatives (THPBs) as Selectivea J Med Chem59:9489-9502 (2016) 
 
Alpha-1A adrenergic receptor
Name:Alpha-1A adrenergic receptor
Type:Cell-surface receptors
Mol. Mass.:51511.67
Organism:Homo sapiens (Human)
Description:P35348
Residue:466
BDBM50195272
NameBDBM50195272
Synonyms:CHEMBL3938121
TypeSmall organic molecule
Emp. Form.C20H17FN2O2
Mol. Mass.336.3596
SMILESFc1ccc2[nH]c3CN4CCc5cc6OCOc6cc5C4Cc3c2c1