Reaction Details
TargetAlpha-1A adrenergic receptor
LigandBDBM50195281
Substrate/Competitorn/a
Meas. Tech.ChEMBL_1617618 (CHEMBL3859687)
IC50 2880±n/a nM
Citation Guo, DLi, JLin, HZhou, YChen, YZhao, FSun, HZhang, DLi, HShoichet, BKShan, LZhang, WXie, XJiang, HLiu, H Design, Synthesis, and Biological Evaluation of Novel Tetrahydroprotoberberine Derivatives (THPBs) as Selectivea J Med Chem59:9489-9502 (2016) 
 
Alpha-1A adrenergic receptor
Name:Alpha-1A adrenergic receptor
Type:Cell-surface receptors
Mol. Mass.:51511.67
Organism:Homo sapiens (Human)
Description:P35348
Residue:466
BDBM50195281
NameBDBM50195281
Synonyms:CHEMBL3967696
TypeSmall organic molecule
Emp. Form.C27H24N2O3
Mol. Mass.424.4911
SMILESC(Oc1ccc2[nH]c3CN4CCc5cc6OCOc6cc5C4Cc3c2c1)c1ccccc1