Reaction Details
TargetAlpha-1A adrenergic receptor
LigandBDBM50160154
Substrate/Competitorn/a
Meas. Tech.ChEMBL_1617618 (CHEMBL3859687)
IC50 1.8±n/a nM
Citation Guo, DLi, JLin, HZhou, YChen, YZhao, FSun, HZhang, DLi, HShoichet, BKShan, LZhang, WXie, XJiang, HLiu, H Design, Synthesis, and Biological Evaluation of Novel Tetrahydroprotoberberine Derivatives (THPBs) as Selectivea J Med Chem59:9489-9502 (2016) 
 
Alpha-1A adrenergic receptor
Name:Alpha-1A adrenergic receptor
Type:Cell-surface receptors
Mol. Mass.:51511.67
Organism:Homo sapiens (Human)
Description:P35348
Residue:466
BDBM50160154
NameBDBM50160154
Synonyms:1-(3-Hydroxy-propyl)-5-((R)-2-{2-[2-(2,2,2-trifluoro-ethoxy)-phenoxy]-ethylamino}-propyl)-2,3-dihydro-1H-indole-7-carboxylic acid amide SILODOSIN
TypeSmall organic molecule
Emp. Form.C25H32F3N3O4
Mol. Mass.495.5345
SMILESC[C@H](Cc1cc2CCN(CCCO)c2c(c1)C(N)=O)NCCOc1ccccc1OCC(F)(F)F