Reaction Details
TargetAlpha-1B adrenergic receptor
LigandBDBM50195273
Substrate/Competitorn/a
Meas. Tech.ChEMBL_1617621 (CHEMBL3859690)
IC50 9170±n/a nM
Citation Guo, DLi, JLin, HZhou, YChen, YZhao, FSun, HZhang, DLi, HShoichet, BKShan, LZhang, WXie, XJiang, HLiu, H Design, Synthesis, and Biological Evaluation of Novel Tetrahydroprotoberberine Derivatives (THPBs) as Selectivea J Med Chem59:9489-9502 (2016) 
 
Alpha-1B adrenergic receptor
Name:Alpha-1B adrenergic receptor
Type:Enzyme
Mol. Mass.:56862.13
Organism:Homo sapiens (Human)
Description:P35368
Residue:520
BDBM50195273
NameBDBM50195273
Synonyms:CHEMBL3948551
TypeSmall organic molecule
Emp. Form.C20H18N2O3
Mol. Mass.334.3685
SMILESOc1ccc2[nH]c3CN4CCc5cc6OCOc6cc5C4Cc3c2c1