Reaction Details
TargetAlpha-1D adrenergic receptor
LigandBDBM50195280
Substrate/Competitorn/a
Meas. Tech.ChEMBL_1617622 (CHEMBL3859691)
IC50>10000±n/a nM
Citation Guo, DLi, JLin, HZhou, YChen, YZhao, FSun, HZhang, DLi, HShoichet, BKShan, LZhang, WXie, XJiang, HLiu, H Design, Synthesis, and Biological Evaluation of Novel Tetrahydroprotoberberine Derivatives (THPBs) as Selectivea J Med Chem59:9489-9502 (2016) 
 
Alpha-1D adrenergic receptor
Name:Alpha-1D adrenergic receptor
Type:Enzyme Catalytic Domain
Mol. Mass.:60485.82
Organism:Homo sapiens (Human)
Description:adrenergic Alpha1D ADRA1D HUMAN::P25100
Residue:572
BDBM50195280
NameBDBM50195280
Synonyms:CHEMBL3984249
TypeSmall organic molecule
Emp. Form.C21H20N2O3
Mol. Mass.348.3951
SMILESCOc1cccc2[nH]c3CN4CCc5cc6OCOc6cc5C4Cc3c12