Reaction Details
TargetAlpha-1B adrenergic receptor
LigandBDBM50195275
Substrate/Competitorn/a
Meas. Tech.ChEMBL_1617626 (CHEMBL3859695)
IC50>1000±n/a nM
Citation Guo, DLi, JLin, HZhou, YChen, YZhao, FSun, HZhang, DLi, HShoichet, BKShan, LZhang, WXie, XJiang, HLiu, H Design, Synthesis, and Biological Evaluation of Novel Tetrahydroprotoberberine Derivatives (THPBs) as Selectivea J Med Chem59:9489-9502 (2016) 
 
Alpha-1B adrenergic receptor
Name:Alpha-1B adrenergic receptor
Type:G Protein-Coupled Receptor (GPCR)
Mol. Mass.:56606.71
Organism:Rattus norvegicus (rat)
Description:Receptor binding assays were performed using rat cortical membranes.
Residue:515
BDBM50195275
NameBDBM50195275
Synonyms:CHEMBL3916182
TypeSmall organic molecule
Emp. Form.C21H20N2O3
Mol. Mass.348.3951
SMILESCOc1ccc2[nH]c3CN4CCc5cc6OCOc6cc5C4Cc3c2c1