Reaction Details
TargetAlpha-1D adrenergic receptor
LigandBDBM50195271
Substrate/Competitorn/a
Meas. Tech.ChEMBL_1617622 (CHEMBL3859691)
IC50>10000±n/a nM
Citation Guo, DLi, JLin, HZhou, YChen, YZhao, FSun, HZhang, DLi, HShoichet, BKShan, LZhang, WXie, XJiang, HLiu, H Design, Synthesis, and Biological Evaluation of Novel Tetrahydroprotoberberine Derivatives (THPBs) as Selectivea J Med Chem59:9489-9502 (2016) 
 
Alpha-1D adrenergic receptor
Name:Alpha-1D adrenergic receptor
Type:Enzyme Catalytic Domain
Mol. Mass.:60485.82
Organism:Homo sapiens (Human)
Description:adrenergic Alpha1D ADRA1D HUMAN::P25100
Residue:572
BDBM50195271
NameBDBM50195271
Synonyms:CHEMBL3937032
TypeSmall organic molecule
Emp. Form.C20H18N2O2
Mol. Mass.318.3691
SMILES[H][C@@]12Cc3c(CN1CCc1cc4OCOc4cc21)[nH]c1ccccc31