Reaction Details
TargetAlpha-1A adrenergic receptor
LigandBDBM50195285
Substrate/Competitorn/a
Meas. Tech.ChEMBL_1617618 (CHEMBL3859687)
IC50>10000±n/a nM
Citation Guo, DLi, JLin, HZhou, YChen, YZhao, FSun, HZhang, DLi, HShoichet, BKShan, LZhang, WXie, XJiang, HLiu, H Design, Synthesis, and Biological Evaluation of Novel Tetrahydroprotoberberine Derivatives (THPBs) as Selectivea J Med Chem59:9489-9502 (2016) 
 
Alpha-1A adrenergic receptor
Name:Alpha-1A adrenergic receptor
Type:Cell-surface receptors
Mol. Mass.:51511.67
Organism:Homo sapiens (Human)
Description:P35348
Residue:466
BDBM50195285
NameBDBM50195285
Synonyms:CHEMBL3977758
TypeSmall organic molecule
Emp. Form.C28H28N2O3
Mol. Mass.440.5335
SMILESCOc1ccc2[nH]c3CN4CCc5cc(OCc6ccccc6)c(OC)cc5C4Cc3c2c1