Reaction Details
TargetInduced myeloid leukemia cell differentiation protein Mcl-1
LigandBDBM50195313
Substrate/Competitorn/a
Meas. Tech.ChEMBL_1617652 (CHEMBL3859721)
Ki 60±n/a nM
Citation Wang, MTian, WWang, CLu, SYang, CWang, JSong, YZhou, YZhu, JLi, ZZheng, C Design, synthesis, and activity evaluation of selective inhibitors of anti-apoptotic Bcl-2 proteins: The effects on the selectivity of the P1 pockets in the active sites. Bioorg Med Chem Lett26:5207-5211 (2016) 
 
Induced myeloid leukemia cell differentiation protein Mcl-1
Name:Induced myeloid leukemia cell differentiation protein Mcl-1
Type:Membrane; Single-pass membrane protein
Mol. Mass.:37332.87
Organism:Homo sapiens (Human)
Description:Q07820
Residue:350
BDBM50195313
NameBDBM50195313
Synonyms:CHEMBL3895790
TypeSmall organic molecule
Emp. Form.C38H41N3O5S2
Mol. Mass.683.879
SMILESCc1cc2c(cc1C(=C)c1ccc(cc1)C(=O)NS(=O)(=O)c1ccc(NCCSc3ccccc3)c(c1)[N+]([O-])=O)C(C)(C)CCC2(C)C