Reaction Details
TargetBcl-2-like protein 1
LigandBDBM50195317
Substrate/Competitorn/a
Meas. Tech.ChEMBL_1617651 (CHEMBL3859720)
Ki 110±n/a nM
Citation Wang, MTian, WWang, CLu, SYang, CWang, JSong, YZhou, YZhu, JLi, ZZheng, C Design, synthesis, and activity evaluation of selective inhibitors of anti-apoptotic Bcl-2 proteins: The effects on the selectivity of the P1 pockets in the active sites. Bioorg Med Chem Lett26:5207-5211 (2016) 
 
Bcl-2-like protein 1
Name:Bcl-2-like protein 1
Type:Mitochondrion membrane; Single-pass membrane protein
Mol. Mass.:26039.60
Organism:Homo sapiens (Human)
Description:n/a
Residue:233
BDBM50195317
NameBDBM50195317
Synonyms:CHEMBL3926515
TypeSmall organic molecule
Emp. Form.C31H28N4O7S2
Mol. Mass.632.707
SMILESCOc1cccc(\C=C\C(=O)Nc2ccc(cc2)C(=O)NS(=O)(=O)c2ccc(NCCSc3ccccc3)c(c2)[N+]([O-])=O)c1