Reaction Details
TargetApoptosis regulator Bcl-2
LigandBDBM50195314
Substrate/Competitorn/a
Meas. Tech.ChEMBL_1617650 (CHEMBL3859719)
Ki 3400±n/a nM
Citation Wang, MTian, WWang, CLu, SYang, CWang, JSong, YZhou, YZhu, JLi, ZZheng, C Design, synthesis, and activity evaluation of selective inhibitors of anti-apoptotic Bcl-2 proteins: The effects on the selectivity of the P1 pockets in the active sites. Bioorg Med Chem Lett26:5207-5211 (2016) 
 
Apoptosis regulator Bcl-2
Name:Apoptosis regulator Bcl-2
Type:Homodimer or heterodimer
Mol. Mass.:26269.11
Organism:Homo sapiens (Human)
Description:P10415
Residue:239
BDBM50195314
NameBDBM50195314
Synonyms:CHEMBL3947409
TypeSmall organic molecule
Emp. Form.C28H23N3O6S2
Mol. Mass.561.629
SMILES[O-][N+](=O)c1cc(ccc1NCCSc1ccccc1)S(=O)(=O)NC(=O)c1ccc(cc1)C(=O)c1ccccc1