Reaction Details
TargetWD repeat-containing protein 5
LigandBDBM50195454
Substrate/Competitorn/a
Meas. Tech.ChEMBL_1617717 (CHEMBL3859786)
IC50>20±n/a nM
Citation Li, DDWang, ZHChen, WLXie, YYYou, QDGuo, XK Structure-based design of ester compounds to inhibit MLL complex catalytic activity by targeting mixed lineage leukemia 1 (MLL1)-WDR5 interaction. Bioorg Med Chem24:6109-6118 (2016) 
 
WD repeat-containing protein 5
Name:WD repeat-containing protein 5
Type:Protein
Mol. Mass.:36597.13
Organism:Homo sapiens (Human)
Description:P61964
Residue:334
BDBM50195454
NameBDBM50195454
Synonyms:CHEMBL3893446
TypeSmall organic molecule
Emp. Form.C26H30ClFN4O5
Mol. Mass.532.992
SMILESCN1CCN(CC1)c1ccc(cc1NC(=O)c1cc(c(F)c(C)c1Cl)[N+]([O-])=O)C(=O)OC1CCCCC1