Reaction Details
TargetHistone-lysine N-methyltransferase 2A/Retinoblastoma-binding protein 5/Set1/Ash2 histone methyltransferase complex subunit ASH2/WD repeat-containing protein 5
LigandBDBM50164787
Substrate/Competitorn/a
Meas. Tech.ChEMBL_1617726 (CHEMBL3859795)
IC50 300±n/a nM
Citation Li, DDWang, ZHChen, WLXie, YYYou, QDGuo, XK Structure-based design of ester compounds to inhibit MLL complex catalytic activity by targeting mixed lineage leukemia 1 (MLL1)-WDR5 interaction. Bioorg Med Chem24:6109-6118 (2016) 
 
Histone-lysine N-methyltransferase 2A/Retinoblastoma-binding protein 5/Set1/Ash2 histone methyltransferase complex subunit ASH2/WD repeat-containing protein 5
Name:Histone-lysine N-methyltransferase 2A/Retinoblastoma-binding protein 5/Set1/Ash2 histone methyltransferase complex subunit ASH2/WD repeat-containing protein 5
Type:Protein
Mol. Mass.:n/a
Description:n/a
Components:This complex has 4 components.
Component 1
Name:Histone-lysine N-methyltransferase 2A
Synonyms:ALL-1 ALL1 CXXC-type zinc finger protein 7 HRX Histone-lysine N-methyltransferase 2A KMT2A_HUMAN MLL MLL cleavage product N320 Myeloid/lymphoid or mixed-lineage leukemia Myeloid/lymphoid or mixed-lineage leukemia protein 1 TRX1 Zinc finger protein HRX p320
Type:Protein
Mol. Mass.:431905.67
Organism:Homo sapiens (Human)
Description:Q03164
Residue:3969
Component 2
Name:WD repeat-containing protein 5
Synonyms:BIG3 WD repeat-containing protein 5 (WDR5) WDR5 | WDR5_HUMAN
Type:Protein
Mol. Mass.:36597.13
Organism:Homo sapiens (Human)
Description:P61964
Residue:334
Component 3
Name:Retinoblastoma-binding protein 5
Synonyms:RBBP5 RBQ3 | Retinoblastoma-binding protein 5 (RBBP5)
Type:Protein
Mol. Mass.:59133.29
Organism:Homo sapiens (Human)
Description:Q15291
Residue:538
Component 4
Name:Set1/Ash2 histone methyltransferase complex subunit ASH2
Synonyms:ASH2L ASH2L_HUMAN | Ash2-like protein (ASH2L)
Type:Protein
Mol. Mass.:68712.48
Organism:Homo sapiens (Human)
Description:Q9UBL3
Residue:628
BDBM50164787
NameBDBM50164787
Synonyms:CHEMBL3798088
TypeSmall organic molecule
Emp. Form.C29H46N8O5
Mol. Mass.586.7261
SMILESCC[C@@H]1NC(=O)[C@H](CCCNC(N)=N)NC(=O)[C@@](C)(CCCCNC(=O)[C@H](NC1=O)c1ccccc1)NC(=O)C(C)C