Reaction Details
TargetHistone-lysine N-methyltransferase EHMT2
LigandBDBM50442103
Substrate/Competitorn/a
Meas. Tech.ChEMBL_1617770 (CHEMBL3859839)
IC50<2.5±n/a nM
Citation Chen, WLWang, ZHFeng, TTLi, DDWang, CHXu, XLZhang, XJYou, QDGuo, XK Discovery, design and synthesis of 6H-anthra[1,9-cd]isoxazol-6-one scaffold as G9a inhibitor through a combination of shape-based virtual screening and structure-based molecular modification. Bioorg Med Chem24:6102-6108 (2016) 
 
Histone-lysine N-methyltransferase EHMT2
Name:Histone-lysine N-methyltransferase EHMT2
Type:Enzyme
Mol. Mass.:132339.87
Organism:Homo sapiens (Human)
Description:Q96KQ7
Residue:1210
BDBM50442103
NameBDBM50442103
Synonyms:CHEMBL2441082
TypeSmall organic molecule
Emp. Form.C29H44F2N6O2
Mol. Mass.546.6955
SMILESCOc1cc2c(NC3CCN(CC3)C(C)C)nc(nc2cc1OCCCN1CCCC1)N1CCC(F)(F)CC1