Reaction Details
Target5'-AMP-activated protein kinase subunit beta-1
LigandBDBM50195477
Substrate/Competitorn/a
Meas. Tech.ChEMBL_1617782 (CHEMBL3859851)
EC50 0.700000±n/a nM
Citation Cameron, KOKurumbail, RG Recent progress in the identification of adenosine monophosphate-activated protein kinase (AMPK) activators. Bioorg Med Chem Lett26:5139-5148 (2016) 
 
5'-AMP-activated protein kinase subunit beta-1
Name:5'-AMP-activated protein kinase subunit beta-1
Type:n/a
Mol. Mass.:30380.94
Organism:Homo sapiens (Human)
Description:Q9Y478
Residue:270
BDBM50195477
NameBDBM50195477
Synonyms:CHEMBL3979403
TypeSmall organic molecule
Emp. Form.C22H16ClN3O4
Mol. Mass.421.833
SMILESCOc1cc(on1)C(O)=C1C(=O)Nc2cc(Cl)c(cc12)-c1ccc2n(C)ccc2c1