Reaction Details
TargetBroad substrate specificity ATP-binding cassette transporter ABCG2
LigandBDBM32628
Substrate/Competitorn/a
Meas. Tech.ChEMBL_1617829 (CHEMBL3859898)
IC50 960±n/a nM
Citation Schmitt, FDraut, HBiersack, BSchobert, R Halogenated naphthochalcones and structurally related naphthopyrazolines with antitumor activity. Bioorg Med Chem Lett26:5168-5171 (2016) 
 
Broad substrate specificity ATP-binding cassette transporter ABCG2
Name:Broad substrate specificity ATP-binding cassette transporter ABCG2
Type:Multi-pass membrane protein; monomer or homodimer; disulfide-linked
Mol. Mass.:72329.48
Organism:Homo sapiens (Human)
Description:Q9UNQ0
Residue:655
BDBM32628
NameBDBM32628
Synonyms:FTC | Fumitremorgin C
TypeSmall organic molecule
Emp. Form.C22H25N3O3
Mol. Mass.379.4522
SMILES[H][C@@]12CCCN1C(=O)[C@]1([H])Cc3c([nH]c4cc(OC)ccc34)[C@H](C=C(C)C)N1C2=O