Reaction Details
TargetLysophosphatidic acid receptor 1
LigandBDBM50195700
Substrate/Competitorn/a
Meas. Tech.ChEMBL_1617900 (CHEMBL3859969)
IC50 3.5±n/a nM
Citation Terakado, MSuzuki, HHashimura, KTanaka, MUeda, HKohno, HFujimoto, TSaga, HNakade, SHabashita, HTakaoka, YSeko, T Discovery of ONO-7300243 from a Novel Class of Lysophosphatidic Acid Receptor 1 Antagonists: From Hit to Lead. ACS Med Chem Lett7:913-918 (2016) 
 
Lysophosphatidic acid receptor 1
Name:Lysophosphatidic acid receptor 1
Type:Enzyme
Mol. Mass.:41120.55
Organism:Homo sapiens (Human)
Description:Q92633
Residue:364
BDBM50195700
NameBDBM50195700
Synonyms:CHEMBL3975893
TypeSmall organic molecule
Emp. Form.C33H32ClNO6
Mol. Mass.574.063
SMILESCOc1cc(cc(OC)c1C)C(=O)N(CCCc1ccccc1)Cc1ccc(Oc2ccc(Cl)cc2C(O)=O)cc1