Reaction Details
TargetKinesin-like protein KIF20B
LigandBDBM50056904
Substrate/Competitorn/a
Meas. Tech.ChEMBL_1618000 (CHEMBL3860169)
IC50 5800±n/a nM
Citation Talapatra, SKRath, OClayton, ETomasi, SKozielski, F Depsidones from Lichens as Natural Product Inhibitors of M-Phase Phosphoprotein 1, a Human Kinesin Required for Cytokinesis. J Nat Prod79:1576-85 (2016) 
 
Kinesin-like protein KIF20B
Name:Kinesin-like protein KIF20B
Type:PROTEIN
Mol. Mass.:210600.28
Organism:Homo sapiens (Human)
Description:ChEMBL_104519
Residue:1820
BDBM50056904
NameBDBM50056904
Synonyms:3,8-Dihydroxy-11-oxo-1-(2-oxo-heptyl)-6-pentyl-11H-dibenzo[b,e][1,4]dioxepine-7-carboxylic acid NSC-685589 cid_65751 | physodic acid
TypeSmall organic molecule
Emp. Form.C26H30O8
Mol. Mass.470.5116
SMILESCCCCCC(=O)Cc1cc(O)cc2Oc3c(OC(=O)c12)cc(O)c(C(O)=O)c3CCCCC