Reaction Details
TargetEpidermal growth factor receptor
LigandBDBM50196096
Substrate/Competitorn/a
Meas. Tech.ChEMBL_1618202 (CHEMBL3860371)
IC50 351±n/a nM
Citation Lelais, GEpple, RMarsilje, THLong, YOMcNeill, MChen, BLu, WAnumolu, JBadiger, SBursulaya, BDiDonato, MFong, RJuarez, JLi, JManuia, MMason, DEGordon, PGroessl, TJohnson, KJia, YKasibhatla, SLi, CIsbell, JSpraggon, GBender, SMichellys, PY Discovery of (R,E)-N-(7-Chloro-1-(1-[4-(dimethylamino)but-2-enoyl]azepan-3-yl)-1H-benzo[d]imidazol-2-yl)-2-methylisonicotinamide (EGF816), a Novel, Potent, and WT Sparing Covalent Inhibitor of Oncogenic (L858R, ex19del) and Resistant (T790M) EGFR Mutants for the Treatment of EGFR Mutant Non-Small-Ce J Med Chem59:6671-89 (2016) 
 
Epidermal growth factor receptor
Name:Epidermal growth factor receptor
Type:Receptor Kinase Domain
Mol. Mass.:134279.59
Organism:Homo sapiens (Human)
Description:P00533
Residue:1210
BDBM50196096
NameBDBM50196096
Synonyms:CHEMBL3951434
TypeSmall organic molecule
Emp. Form.C28H32F3N5O2
Mol. Mass.527.5812
SMILESCN(C)C\C=C\C(=O)N1CCCC[C@H](C1)n1c(NC(=O)c2cccc(c2)C(F)(F)F)nc2cccc(C)c12