Reaction Details
TargetEpidermal growth factor receptor
LigandBDBM50196237
Substrate/Competitorn/a
Meas. Tech.ChEMBL_1618196 (CHEMBL3860365)
IC50 5270±n/a nM
Citation Lelais, GEpple, RMarsilje, THLong, YOMcNeill, MChen, BLu, WAnumolu, JBadiger, SBursulaya, BDiDonato, MFong, RJuarez, JLi, JManuia, MMason, DEGordon, PGroessl, TJohnson, KJia, YKasibhatla, SLi, CIsbell, JSpraggon, GBender, SMichellys, PY Discovery of (R,E)-N-(7-Chloro-1-(1-[4-(dimethylamino)but-2-enoyl]azepan-3-yl)-1H-benzo[d]imidazol-2-yl)-2-methylisonicotinamide (EGF816), a Novel, Potent, and WT Sparing Covalent Inhibitor of Oncogenic (L858R, ex19del) and Resistant (T790M) EGFR Mutants for the Treatment of EGFR Mutant Non-Small-Ce J Med Chem59:6671-89 (2016) 
 
Epidermal growth factor receptor
Name:Epidermal growth factor receptor
Type:Receptor Kinase Domain
Mol. Mass.:134279.59
Organism:Homo sapiens (Human)
Description:P00533
Residue:1210
BDBM50196237
NameBDBM50196237
Synonyms:CHEMBL3937373
TypeSmall organic molecule
Emp. Form.C22H22F3N3O2
Mol. Mass.417.4242
SMILESCc1cccc2nc(NC(=O)c3cccc(c3)C(F)(F)F)n([C@H]3CC[C@H](O)CC3)c12