Reaction Details
TargetHigh affinity choline transporter 1
LigandBDBM50067207
Substrate/Competitorn/a
Meas. Tech.ChEMBL_1618520 (CHEMBL3860689)
IC50 72±n/a nM
Citation Bertron, JLEnnis, EATarr, CJWright, JDickerson, JWLocuson, CWBlobaum, ALRook, JMBlakely, RDLindsley, CW Optimization of the choline transporter (CHT) inhibitor ML352: Development of VU6001221, an improved in vivo tool compound. Bioorg Med Chem Lett26:4637-4640 (2016) 
 
High affinity choline transporter 1
Name:High affinity choline transporter 1
Type:PROTEIN
Mol. Mass.:63194.33
Organism:Homo sapiens (Human)
Description:ChEMBL_1464247
Residue:580
BDBM50067207
NameBDBM50067207
Synonyms:CHEMBL3304438
TypeSmall organic molecule
Emp. Form.C21H29N3O4
Mol. Mass.387.4727
SMILESCOc1ccc(cc1OC1CCN(C)CC1)C(=O)NCc1cc(no1)C(C)C