Reaction Details
TargetHigh affinity choline transporter 1
LigandBDBM50196412
Substrate/Competitorn/a
Meas. Tech.ChEMBL_1618520 (CHEMBL3860689)
IC50 270±n/a nM
Citation Bertron, JLEnnis, EATarr, CJWright, JDickerson, JWLocuson, CWBlobaum, ALRook, JMBlakely, RDLindsley, CW Optimization of the choline transporter (CHT) inhibitor ML352: Development of VU6001221, an improved in vivo tool compound. Bioorg Med Chem Lett26:4637-4640 (2016) 
 
High affinity choline transporter 1
Name:High affinity choline transporter 1
Type:PROTEIN
Mol. Mass.:63194.33
Organism:Homo sapiens (Human)
Description:ChEMBL_1464247
Residue:580
BDBM50196412
NameBDBM50196412
Synonyms:CHEMBL3933906
TypeSmall organic molecule
Emp. Form.C20H26ClN3O3
Mol. Mass.391.892
SMILESCC(C)c1cc(CNC(=O)c2ccc(Cl)c(OC3CCN(C)CC3)c2)on1