Reaction Details
TargetKiSS-1 receptor
LigandBDBM50196439
Substrate/Competitorn/a
Meas. Tech.ChEMBL_1618632 (CHEMBL3860801)
EC50 0.430000±n/a nM
Citation Nishizawa, NTakatsu, YKumano, SKiba, ABan, JTsutsumi, SMatsui, HMatsumoto, SIYamaguchi, MIkeda, YKusaka, MOhtaki, TItoh, FAsami, T Design and Synthesis of an Investigational Nonapeptide KISS1 Receptor (KISS1R) Agonist, Ac-d-Tyr-Hydroxyproline (Hyp)-Asn-Thr-Phe-azaGly-Leu-Arg(Me)-Trp-NH J Med Chem59:8804-8811 (2016) 
 
KiSS-1 receptor
Name:KiSS-1 receptor
Type:G Protein-Coupled Receptor (GPCR)
Mol. Mass.:42613.79
Organism:Homo sapiens (Human)
Description:Binding assay was performed using membranes from the CHO cell transfectants.
Residue:398
BDBM50196439
NameBDBM50196439
Synonyms:CHEMBL3949224
TypeSmall organic molecule
Emp. Form.C59H84FN17O13
Mol. Mass.1258.4028
SMILESCNC(=N)NCCC[C@H](NC(=O)[C@H](CC(C)C)NC(=O)NNC(=O)[C@H](Cc1cccc(F)c1)NC(=O)[C@@H](NC(=O)[C@H](CC(N)=O)NC(=O)[C@H](CCCCN)NC(=O)[C@@H](Cc1ccc(O)cc1)NC(C)=O)[C@@H](C)O)C(=O)N[C@@H](Cc1c[nH]c2ccccc12)C(N)=O