Reaction Details
TargetKiSS-1 receptor
LigandBDBM50196418
Substrate/Competitorn/a
Meas. Tech.ChEMBL_1618633 (CHEMBL3860802)
EC50 16±n/a nM
Citation Nishizawa, NTakatsu, YKumano, SKiba, ABan, JTsutsumi, SMatsui, HMatsumoto, SIYamaguchi, MIkeda, YKusaka, MOhtaki, TItoh, FAsami, T Design and Synthesis of an Investigational Nonapeptide KISS1 Receptor (KISS1R) Agonist, Ac-d-Tyr-Hydroxyproline (Hyp)-Asn-Thr-Phe-azaGly-Leu-Arg(Me)-Trp-NH J Med Chem59:8804-8811 (2016) 
 
KiSS-1 receptor
Name:KiSS-1 receptor
Type:PROTEIN
Mol. Mass.:42915.37
Organism:Rattus norvegicus
Description:ChEMBL_1448383
Residue:396
BDBM50196418
NameBDBM50196418
Synonyms:CHEMBL3967058
TypeSmall organic molecule
Emp. Form.C57H78N16O13
Mol. Mass.1195.3286
SMILESCNC(=N)NCCC[C@H](NC(=O)[C@H](CC(C)C)NC(=O)NNC(=O)[C@H](Cc1ccccc1)NC(=O)[C@@H](NC(=O)[C@H](CC(N)=O)NC(=O)[C@@H]1CCN1C(=O)[C@@H](Cc1ccc(O)cc1)NC(C)=O)[C@@H](C)O)C(=O)N[C@@H](Cc1c[nH]c2ccccc12)C(N)=O