Reaction Details
TargetHistone deacetylase (HDAC1 and HDAC2)
LigandBDBM50196489
Substrate/Competitorn/a
Meas. Tech.ChEMBL_1618726 (CHEMBL3860895)
IC50 528±n/a nM
Citation Jiao, PJin, PLi, CCui, LDong, LPan, BSong, WMa, LDong, JSong, LJin, XLi, FWan, MLv, ZGeng, Q Design, synthesis and in vitro evaluation of amidoximes as histone deacetylase inhibitors for cancer therapy. Bioorg Med Chem Lett26:4679-4683 (2016) 
 
Histone deacetylase (HDAC1 and HDAC2)
Name:Histone deacetylase (HDAC1 and HDAC2)
Type:n/a
Mol. Mass.:n/a
Description:ASSAY_ID of ChEMBL is 2197604
Components:This complex has 2 components.
Component 1
Name:Histone deacetylase 1
Synonyms:Cereblon/Histone deacetylase 1 HDAC1 Histone deacetylase 1 (HDAC1) RPD3L1
Type:Enzyme
Mol. Mass.:55090.27
Organism:Homo sapiens (Human)
Description:Q13547
Residue:482
Component 2
Name:Histone deacetylase 2
Synonyms:Cereblon/Histone deacetylase 2 HDAC2 Histone deacetylase 2 (HDAC2) | Human HDAC2
Type:Chromatin regulator; hydrolase; repressor
Mol. Mass.:55356.54
Organism:Homo sapiens (Human)
Description:Q92769
Residue:488
BDBM50196489
NameBDBM50196489
Synonyms:CHEMBL3937238
TypeSmall organic molecule
Emp. Form.C14H22N4O2
Mol. Mass.278.3501
SMILESCCCCNCCC(=O)Nc1ccc(cc1)C(\N)=N\O