Reaction Details
TargetcGMP-specific 3',5'-cyclic phosphodiesterase
LigandBDBM50196780
Substrate/Competitorn/a
Meas. Tech.ChEMBL_1618821 (CHEMBL3860990)
IC50 34±n/a nM
Citation Rabal, OSánchez-Arias, JACuadrado-Tejedor, Mde Miguel, IPérez-González, MGarcía-Barroso, CUgarte, AEstella-Hermoso de Mendoza, ASáez, EEspelosin, MUrsua, SHaizhong, TWei, WMusheng, XGarcia-Osta, AOyarzabal, J Design, Synthesis, and Biological Evaluation of First-in-Class Dual Acting Histone Deacetylases (HDACs) and Phosphodiesterase 5 (PDE5) Inhibitors for the Treatment of Alzheimer's Disease. J Med Chem59:8967-9004 (2016) 
 
cGMP-specific 3',5'-cyclic phosphodiesterase
Name:cGMP-specific 3',5'-cyclic phosphodiesterase
Type:Protein
Mol. Mass.:99975.83
Organism:Homo sapiens (Human)
Description:O76074
Residue:875
BDBM50196780
NameBDBM50196780
Synonyms:CHEMBL3955253
TypeSmall organic molecule
Emp. Form.C22H27N5O4
Mol. Mass.425.4809
SMILESCCOc1ccc(C[C@H]2C[C@H](C2)C(=O)NO)cc1-c1nc2c(CC)nn(C)c2c(=O)[nH]1